简介:Arm官方Cortex-M3 DesignStart Kit是一个面向嵌入式开发者的处理器设计套件,适合需要在FPGA上快速集成Cortex-M3核进行原型验证的工程师与学习SoC/MCU设计的进阶用户。该套件围绕AT421-MN-80001-r0p0-00rel0版本展开,提供RTL源码、参考工程、调试配置与开发文档,可用于评估核性能、开展RTOS移植和工业控制/消费电子等场景的应用开发。压缩包共611个文件,约14.64MB,主要包含274个v格式RTL源文件、69个h与55个c格式驱动/应用源码、bin/axf可执行映像,以及Keil工程文件、makefile构建脚本、PDF手册和测试程序,结构清晰,便于按模块查阅。资源中可见自检、GPIO、中断、定时器、睡眠等示例工程,有助于理解Cortex-M3中断延迟、Thumb-2指令集、调试接口和存储保护等关键特性。目前已有1069人学习下载,适合希望快速上手DesignStart流程并深入掌握Cortex-M3嵌入式开发的学习者。
1. 把 Cortex-M3 从 ARM 官方压缩包变成可用的 FPGA SoC:DesignStart Kit 到底给了你什么
ARM M3 CPU 的软核实现一直是很多开发者想碰又不敢碰的东西。市面上能拿到授权又能合法落地的方案不多,而 DesignStart Kit 几乎是门槛最低的一条路。这份 AT421-MN-80001-r0p0-00rel0.tgz 是 ARM 官方发布的 Cortex-M3 参考设计包,解压之后你能拿到完整的 RTL 源码、SoC 子系统参考设计、仿真脚本和 FPGA 实现工程,不需要额外购买商业授权,评估和教学场景可以直接用。它解决的核心问题是:你不必从零写一个 ARM 兼容内核,也不用被复杂授权流程卡住,解包、搭总线、跑仿真、上板验证,一条链路是通的。适合三类人:想做 SoC 但缺 CPU 的 FPGA 开发者、想研究 Cortex-M3 内部总线行为的体系结构学习者、以及需要在设计里挂一个成熟内核做控制的嵌入式工程师。
2. 拆开压缩包:DesignStart 目录、文件与三件核心资产
2.1 目录结构:哪些文件是你要的,哪些可以不管
拿到压缩包,第一步不是急着解压,而是先看包结构。常见做法是先把 .tgz 归档列出来,确认版本和文件完整性,再按需解压。解压后你会看到一个典型的 ARM SSD 风格目录布局:rtl/存的是 Cortex-M3 内核 RTL 和 SoC 子系统 RTL,scripts/放的是仿真和综合脚本,docs/下是配置手册和集成指南,还有examples/或demo/之类存放参考工程的位置。
实际解压时建议这样做:
tar -tzf AT421-MN-80001-r0p0-00rel0.tgz | head -50 mkdir -p arm_m3_designstart && tar -xzf AT421-MN-80001-r0p0-00rel0.tgz -C arm_m3_designstart cd arm_m3_designstart && ls -la先列目录再解压是为了确认你不是在磁盘空间不足的情况下盲目展开全部文件。解压到独立目录的原因是:DesignStart 的 RTL 里包含大量相对路径引用,脚本会以顶层目录为根来搜索rtl/和sim/,如果文件被散落到多个目录,后续跑仿真时会出现file not found的连锁错误。ls -la这一步是确认符号链接和脚本权限没有被 tar 过程弄丢,尤其是.sh脚本。
2.2 三件核心资产:CPU RTL、SoC 参考设计与内存映射
这套包的核心可以分成三层。第一层是cortexm3_logic和cortexm3_integration这类 RTL 文件,后者是前者的实例化封装,把 CPU 内核、NVIC 中断控制器、调试访客接口、总线接口单元全部接好,对外暴露 AHB-Lite 主接口和 AHB-Lite 从接口。你不需要在内核内部做任何修改,只要用cortexm3_integration这个顶层模块接到自己的系统总线上即可。
第二层是 SoC 参考设计。DesignStart 包里通常会带一个subsystem或soc层级的 RTL,里面已经例化了一个 SRAM 控制器、一个 AHB-Lite 到 APB 的桥、若干 GPIO 和 UART 外设。这个子系统给用户的信号是:如果你不想自己画总线拓扑,直接用它就好。
第三层是 memory map 定义。Cortex-M3 的 4GB 地址空间被固定划分成 code、SRAM、外设、私有外设等区域,包里的system级文件会预定义好基地址和外设地址段。你需要关注的参数如下表:
| 地址段 | 默认用途 | 在 DesignStart 中的默认实现 |
|---|---|---|
| 0x00000000–0x1FFFFFFF | Code / Flash | SRAM 作为 boot 地址映射 |
| 0x20000000–0x3FFFFFFF | SRAM | 内部 SRAM 控制器接口 |
| 0x40000000–0x5FFFFFFF | 外设 | APB UART、GPIO、Timer |
| 0xE0000000–0xE00FFFFF | 私有外设 | NVIC、SysTick、调试组件 |
拿到这份映射表你就可以开始规划自己的外设。常见错误是有人把外设挂在 SRAM 段,结果 CPU 执行到那个地址时产生总线错误。DesignStart 的 AHB-Lite 从设备 decoder 只认预定义的地址窗口,超出窗口的访问会在总线层面被 abort,这个行为在仿真里表现为HREADY拉低。
2.3 授权边界:评估和商业开发的分水岭
需要讲清楚一件事:DesignStart 允许你下载、仿真、在 FPGA 上做评估,但商业 tape-out 需要单独签商业授权协议。License 文本在解压后的docs/目录里,一条条读完是枯燥,但你至少应该确认两点:一是你当前的使用场景是否属于评估/教学范畴,二是如果用于商业 ASIC 流片,需要走什么流程。很多人在这个问题上栽跟头,觉得在 FPGA 上验证过了就可以直接拿去流片,结果用到的 RTL 版本授权范围和预期不一致,后面补授权流程很被动。
我一般会在项目启动时就把授权确认结果写进设计文档,避免半年后发现评估版的 RTL 已经融进了商业项目里。
3. 在 Vivado 里跑通 M3:从 RTL 到比特流的完整流程与参数设置
3.1 建立工程前的环境准备
DesignStart 的 RTL 是普通 Verilog,理论上支持 Aldec、Cadence、Synopsys、Mentor 等主流仿真器和综合工具,但本次以 Vivado 为例。开始之前先确认几件事:Vivado 版本建议 2020.1 以上,低版本对 SystemVerilog 文件和后缀.v的混用处理有差异;工程必须放在纯英文路径下,中文路径会导致 IP 核生成脚本解析报错;解压目录不要放在系统保护目录下,否则 Vivado 写临时文件时会因为权限问题中途失败。
创建工程建议用批处理模式,一次性把源文件加全,比在 GUI 里一个个添加靠谱。一个最常见的翻车点是cortexm3_defs.v这类全局宏定义文件没有排在编译列表最前面,导致后面的文件引用宏时全部报 undefined。推荐用以下方式创建:
vivado -mode batch -source create_prj.tcl3.2 RTL 源文件的有序添加
在create_prj.tcl脚本里,核心是add_files -norecurse和import_files的组合使用。但真正的关键不在命令本身,而在文件顺序。Cortex-M3 的 RTL 文件之间存在宏依赖,cortexm3_defs.v必须在所有文件之前编译。RedHat 系的开发者可能习惯了vlogan的顺序敏感检查,Vivado 在这方面一样敏感,只是报错信息更隐蔽,往往是某个信号名未定义。
所以我写 tcl 脚本时会把源文件分成两组,第一组是全局宏和包定义文件,第二组是其余全部.v文件,最后再把 SoC 子系统的.v文件追加进来。-norecurse配合显式文件列表可以避免目录下被误加入仿真产生的自动生成文件。
set rtl_dir "../rtl" add_files -norecurse [list \ "$rtl_dir/cortexm3_defs.v" \ "$rtl_dir/cortexm3_logic.v" \ "$rtl_dir/cortexm3_integration.v" \ "$rtl_dir/cortexm3_dap.v" \ "$rtl_dir/cortexm3_soc.v" \ ] update_compile_order -fileset sources_1这里的逻辑说明:cortexm3_defs.v放第一位是为后续文件提供参数宏,cortexm3_logic是 CPU 核心 RTL,cortexm3_integration是对外的封装层,cortexm3_dap是调试访问端口,cortexm3_soc则是整个 SoC 集成。update_compile_order让 Vivado 重新计算编译依赖关系,确认各文件不会被提前编译。如果不执行这一步,综合时可能出现Cannot find signal这类诡异报错。
参数说明:如果后续仿真后想加cortexm3_dft等扫描测试相关文件,必须在综合阶段就设置SYNTHESIS宏,而不是在仿真阶段才定义,否则物理综合会用未定义路径去解释 DFT 逻辑。
3.3 顶层连接与关键信号映射
DesignStart 的 SoC 顶层通常会暴露以下信号:AHB-Lite 的HCLK、HRESETn、HADDR、HTRANS、HWRITE、HSIZE、HWDATA、HRDATA,以及若干 GPIO 和 UART 引脚。在 Vivado 里你需要做的是把这些信号映射到 FPGA 引脚上。
这里有一个常见认知误区:有的人以为 AHB-Lite 的信号可以像 APB 一样直接在 FPGA 上拉出来接外设。实际上 AHB-Lite 要求所有从设备在HREADY上做同步握手,如果外设不响应HREADY,总线会进入死等状态。因此你在 FPGA 工程里应该做的是再接一层 AHB-Lite 到 APB 桥,或者用一个成熟的 AHB 总线矩阵 IP 来管理多个外设。
引脚映射的 xdc 约束文件我一般会写成这样:
set_property PACKAGE_PIN W5 [get_ports clk] set_property IOSTANDARD LVCMOS33 [get_ports clk] create_clock -period 20.000 -name sys_clk [get_ports clk] set_property PACKAGE_PIN V17 [get_ports uart_tx] set_property IOSTANDARD LVCMOS33 [get_ports uart_tx]参数说明:create_clock的-period决定了综合时序收敛的目标频率,20ns 对应 50MHz。DesignStart 的 Cortex-M3 在 Artix-7 这类 FPGA 上跑到 50MHz 是比较稳妥的,直接设置 100MHz 也不是不行,但时序收敛时间会变长,而且如果 SRAM 的读写时序没有做寄存器切割,布局布线后很容易出现setup violation。
3.4 综合与实现的时序约束边界
综合完成后,report_timing_summary是最值得细看的报告,重点看WNS(最差负时序裕量)和TNS两个指标。WNS 为正是基本合格,但如果 WNS 在 -1ns 到 -2ns 这个区间,说明你的路径上有一组逻辑延迟较大的组合逻辑,通常出现在 AHB-Lite 地址译码器或 SRAM 地址建立路径上。在这种状态下,与其硬调约束,不如回到 RTL 层看译码器逻辑能不能做流水线切割。
我习惯在综合后先跑一遍report_qor_suggestions,它会给出具体路径建议——是加max_delay约束还是插入寄存器。但注意,DesignStart 的内核路径是 ARM 调好的,外部 SoC 逻辑才是时序瓶颈的主要来源。优先检查挂在总线上的地址译码逻辑,能用SRL16或用现成 IP 的,不用自己写一大段case语句。
4. 从仿真到上板:Cortex-M3 调试链路的常见坑与排查方法
4.1 避坑:Reset 信号释放顺序导致 CPU 跑飞
现象:仿真中 CPU 的 PC 指针跳到 0xFFFFFFFF,或者上板后 UART 完全无输出,逻辑分析仪看 HTRANS 总线一直处于 IDLE 状态。
原因:DesignStart 的 SoC 要求HRESETn必须在时钟稳定后至少保持 3 个周期低电平,同时复位释放时 AHB 总线主设备不能用HTRANS == NONSEQ发起首个访问。很多开发者把复位信号和时钟绑定成同一个控制信号,时钟刚起来就释放复位,导致 CPU 内部状态还没初始化完成就被外部逻辑抢先读取。
解决:产生一个独立的复位释放逻辑,用计数器延迟至少 4 个时钟周期再释放复位。同时在复位释放前把总线从设备的HSEL拉低,主设备拉低HTRANS,确保总线处于 IDLE 状态。具体做法是写一个复位状态机,经过RESET_IDLE -> RESET_SETUP -> RESET_RELEASE三段状态后再进入正常运行态。
4.2 避坑:SRAM 初始化文件与 CPU Boot 地址不对齐
现象:CPU 上电后从 0x00000000 取值,读回来的指令全是 0xFFFF,仿真中存储器模型报出write collision警告。
原因:DesignStart 的 Cortex-M3 在复位后从0x00000000读取初始 SP,从0x00000004读取 Reset Handler 地址。如果你在 FPGA 工程里把 SRAM 的初始化文件生成成了二进制 bin,而 CPU 的指令总线是 32-bit AHB-Lite,存储器的字节序是 Little-Endian,两者只要有一个不匹配就会取到错位数据。还有一个常见问题是初始化文件的地址偏移没有包含 boot 窗口对应的基地址,仿真时 CPU 从 0 地址读,你的存储器却在 0x08000000 起才放数据。
解决:用 ARM 官方工具链编译启动代码,生成 ELF 后再用objcopy转成十六进制格式,写初始化脚本时注意地址偏移。SRAM 的 read 端口和 AHB-Lite 的HADDR之间要按字节地址映射,不要在HWDATA上做位拼接。
4.3 避坑:AHB-Lite 从设备 HREADY 死等造成总线卡死
现象:仿真挂死后看波形,HCLK一直在跑,但HREADY拉低,AHB 总线所有信号冻结在当前状态,CPU 无法推进到下一条指令。
原因:AHB-Lite 协议规定,从设备通过拉低HREADY插入等待周期。如果你在 SoC 里挂了一个慢速外设,又没有在外设接口上实现最基本的HREADY响应逻辑,总线就会被一直卡住。DesignStart 的子系统里 SRAM 是零等待响应的,但如果你的 UART FIFO 没有做写完成信号返回,CPU 对 UART 写地址的访问就可能永远等不到HREADY拉高。
解决:每个从设备都必须实现HREADY信号控制。对于慢速外设,可以加一个 APB 桥,用 APB 的PREADY来反馈给 AHB 层。偷懒的做法是把所有从设备都做成单周期响应,代价是外设时序裕量变小,FPGA 实现时频率上不去。
4.4 避坑:仿真脚本中+define+宏缺失
现象:RTL 仿真时报出一大堆parameter not found错误,或者内存模型的行为和 Datasheet 不符。
原因:DesignStart 的 RTL 用宏定义区分不同配置,比如总线接口宽度、Debug 支持等级、复位向量地址等。仿真脚本如果没有通过+define+ARM_M3_BASIC之类的预编译选项传入宏,默认值可能和你想要的行为不一致。
解决:仿真命令里显式加上需要的宏定义。例如使用 Verilog 仿真器时用+define+ARM_M3_BASIC,使用 VCS 时用+define+ARM_M3_BASIC。同时确认cortexm3_defs.v文件里的ifdef路径没有缺失,宏定义文件里有一堆undef是正常的,但不要为了让编译通过就手动删除。
4.5 避坑:FPGA 上板后 UART 输出乱码
现象:UART 输出是乱码,波特率明显不对,或者输出的第一个字符正确后续全部错位。
原因:DesignStart 的 UART 示例通常使用频率可配置的分频器,默认参考时钟可能是 12MHz 或 24MHz,而你的 FPGA 板卡晶振可能是 50MHz 或 100MHz。分频系数不对,UART 时序直接偏掉。
解决:检查 UART 模块里的分频寄存器默认值,参照板卡实际输入时钟频率重新计算分频参数,修改 RTL 里的默认参数值。不要试图在软件层做波特率校准,那是治标不治本,直接改分频器参数更可靠。
5. 用 ITM 和 SWO 做 Cortex-M3 软核的实机调试:一种不占用额外引脚的低成本验证技巧
DesignStart 的 Cortex-M3 是支持 CoreSight 调试架构的,这意味着只要你在 FPGA 里把 SWO/SWV 引脚引出来,就能用现成的调试器看到 CPU 内部 dump 的信息,完全不需要在 SoC 里额外加一个 UART 调试串口。这个技巧对 FPGA 原型验证特别实用,因为 FPGA 的引脚资源本来就紧张,你未必愿意为了调试多占用一个引脚。
具体做法是:在顶层例化一个简单的 FIFO,把 SWO 数据缓冲后通过串口输出,然后在 PC 端用支持 SWO 的日志工具打开。如果设计里还保留了 ITM 接口,你可以通过调试器配置 ITM 的 stimulus 端口寄存器,把 printf 的数据通过 ITM 通道输出。这一步的本质是:UART 是给产品用的,ITM 是给调试用的,两者的数据通路分开,后面系统软件出问题时也能区分是 CPU 跑飞还是外设故障。
实操时要注意几个细节。第一,SWO 引脚在 FPGA 里需要约束到支持串行协议的普通 IO,不是专用差分对引脚。第二,SWO 的时钟频率要和调试器的配置一致,通常 Cortex-M3 软核的 SWO 频率是系统时钟的 1/4 或 1/8,这个比值在 CPU 配置参数里可以改,但建议保持固定值,否则每次改时钟都要同步改调试器配置。第三,如果调试器不支持 SWO 模式,你还可以退一步只用 ITM 的并行观察点,通过 AHB-AP 接口读内存来观察变量,不过这需要在主机端写一个脚本轮询。
我自己的习惯是把 ITM 作为默认调试通道。平常开发和验证 SoC 时,先用 SWO 看 CPU 内部状态,再用 AHB-Lite 协议分析器看总线事务,两层对比着看。从那以后我每次上板前都先强制走一遍这个验证流程,先把 SWO 信号引出来确认 CPU 有在跑,再测自己的业务逻辑,整个调试效率提升得不是一点半点。希望这个流程对你也有用。
本文还有配套的精品资源,点击获取